{"text_format":"1","workbook":"xlsx","n_sheets":7,"sheets":["Planting GUIDELINES NRCS","Instructions ","calculator","SEEDINGPLANSHEET","Forbs_legumes","grass","Sheet1"],"not_rendered":{"charts":0,"images":2,"macros":1,"external_links":0,"defined_names":66,"comments":1,"pivot_tables":0},"unopened":[],"bounds":{"document_bytes":16777216,"sheet_cells":100000,"rows_first":2000,"rows_last":500,"rows_between":2000,"halvings":0,"cell_chars":16384,"cell_head_chars":4096},"cells_cut":0,"cells_raw":0,"read":"whole","date_system":"1900"}

{"sheet":"Planting GUIDELINES NRCS","index":0,"n_rows":109,"n_cols":1,"rows_kept":109,"cut":false,"hidden":false,"merged":[]}
["Conservation Purpose:"]
["This practice may be applied on lands requiring permanent protective cover that are adjacent to or within 1500 feet of an agricultural field,"]
["or are being converted from agricultural production.  Examples of locations include fields or wet margins, roadsides, areas within or "]
["adjacent to fruit and vegetable production, steep slopes, open upland habitat, reclaimed sand pits, forest edges, right-of-ways etc…"]
["Although larger areas of habitat (1/2 Acre or more) will provide more resources to support pollinator populations, flower rich habitat can "]
["be created in small patches or strips (20 feet wide or more).  "]
["Conservation Cover Seeding Information:"]
["a.) All seed shall be certified or common seed from a commercial supplier and be fully tagged with a test date of no more than 9 months"]
["    old. Wildflower seed prices and PLS information will vary from year to year.  It is very important to contact your seed supplier to obtain "]
["    PLS information before costs are finalized.  Most seed companies list their prices in bulk pounds per acre.  Recommendations are in "]
["    PLS and seed companies, when asked, will give prices on a PLS basis.  "]
[]
["b.) Selected seed mixtures that will be tolerant of soil drainage site conditions."]
["Pollinator Habitat Planting Considerations"]
["a.)  Native wildflowers shall be planted to promote diversity of flowering plants over the entire growing season and provide habitat for"]
{"$rows_left_out":95}
{"sheet":"Instructions ","index":1,"n_rows":40,"n_cols":1,"rows_kept":40,"cut":false,"hidden":false,"merged":[]}
["Instructions to Use Calculator for Planting Beneficial Plants for Pollinator Habitat"]
["(enable marcos, first on calculator sheet)"]
["1. Use the Filter Species Drop Down Boxes to Select Desired Characteristics, if needed. "]
["         Species highlighted in yellow, on the calculator worksheet are being tested at the USDA NRCS Big Flats Plant Materials Center, in New York"]
["         The species list will populate to the right of the calculator.  All characteristics will show up."]
["         State column, is indicative of the NRCS Job Sheet that has been compiled by the States listed, and is NOT where species are found.  ALL species are found in the NE US."]
[]
["3.  Select desired species in first column of the calculator.  A Drop Down Box will appear when cell is selected.  "]
["     Choose a minimum of 3 early- (April to June 15), 3 mid- ( June 15-July 31) and 3 late-season flowering (August to October) species."]
["          More species chosen, the better diversity in the mix.  Keep in mind the cost of each species as well as the final cost.  "]
[]
["4.  Enter in your seeding rate for each species- lbs/A OR desired seeds/sq ft.   These values are expressed as Pure Live Seed or PLS."]
[]
["5.  If you know the lot of seed you are working with, Enter the Purity (%), Germination (%), and Dormant (%) and/or Hard Seed (%), for each"]
["     species .  The Calculator has a DEFAULT PLS of  50% (can change this if you want), and is filled in for you .  It will update once you fill in the information from your seed tag. "]
{"$rows_left_out":26}
{"sheet":"calculator","index":2,"n_rows":114,"n_cols":41,"rows_kept":114,"cut":false,"hidden":false,"merged":[]}
["Seeding Rate Calculator For Conservation Plantings",null,null,null,null,null,null,null,null,null,null,null,"*Please check comments for more information*",null,null,null,null,null,null,null,null,null,null,null,"Flower Time","soil moisture","pollinator ranking","State"]
["Enter desired PLS rate (either lb/A or seeds/sq ft) and seed tag info (if applicable) in shaded areas",null,null,null,null,null,null,null,null,null,null,null,null,null,null,null,null,null,null,null,null,null,null,null,{"$f":"IF($A$5=\"\",\"\",$A$5)","v":""},{"$f":"IF($C$5=\"\",\"\",$C$5)","v":""},{"$f":"IF(calculator!$D$5=\"\",\"\",calculator!$D$5)","v":""},{"$f":"IF(calculator!$E$5=\"\",\"\",calculator!$E$5)","v":""}]
["Select Filter Species Criteria (if any)",null,null,null,null,null,null,null,"CLICK HERE FOR MORE DETAILED PLS INFORMATION",null,null,null,null,null,null,null,null,null,null,null,null,null,null,null,"Common name","scientific name","plant Type","pollinator ranking","Flower Time","bloom color","plant ht (ft)","soil moisture","sunlight needs","ph","Vegetative spread","seeds/ lb*","Cost (lb) ($)","drainage","other","wetland indicator","State"]
["Flower Time",null,"soil moisture","pollinator ranking","State ",null,null,null,"When seed is order on a PLS basis, Change the price column",null,null,null,null,null,null,null,null,null,"The bulk info columns are handy when",null,null,null,null,null,"black bugbane","Actaea racemosa","P","high","early, mid","white","3-6","medium, wet","sun-part",null,"slow",500000,300,null,"blooms earlier than the others","FACW","any,"]
[null,null,null,null,null,null,null,null,"Accordinly. No need to look at Bulk info.",null,null,null,null,null,null,null,null,null,"PLANNING your mix.  It is based on 50% PLS.",null,null,null,null,null,"purple false foxglove","Agalinis purpurea","A","high","early, mid, late","purple","1-2","medium, wet","sun-part",null,null,12480000,500,"WD,MWDMSPD, PD","high bee preference","FACW","any,"]
["For more information on each plant, go to forbs_legumes worksheet and click on species",null,null,null,null,null,null,null,null,null,"PLS INFO",null,null,"  seed tag information",null,null,null,null,null,null,"BULK INFO",null,null,null,"lavender hysoop","Agastache foeniculum","P","high","mid, late","blue-violet","3-5","dry, medium","sun-part",null,"slow",1440000,172,"WD ","honey bee, bumble bee (N)","FACU","any,mn,wv"]
["Common Name","Scientific Name","PLS**/lb","bloom time","soil moisture","$/ bulk lb","lb PLS/A ","bulk lb/A","% of mix/A PLS","seeds/A PLS","seeds/sq ft PLS","% PLS of mix by # of seeds/A ","Estimated $ PLS species/A","pure seed (%)","germ (%)","dormant + hard seed (%)","PLS (%)","conversion factor","Bulk Seed Needed (lb/A)","Estimated Price/lb of bulk seed","seeds/A Bulk","seeds/sq ft (bulk)",null,null,"yellow giant hyssop","Agastache nepetoides","P","high","late","yellow","3-8","dry, medium","sun-part",null,null,1480000,200,null,null,"FACU","any,mn,wv"]
[null,null,{"$f":"IF(A8=\"\",\"\",VLOOKUP(A8,NEWALLSPECIES,12,FALSE))","v":""},{"$f":"IF(A8=\"\",\"\",VLOOKUP(A8,NEWALLSPECIES,5,FALSE))","v":""},{"$f":"IF(A8=\"\",\"\",VLOOKUP(A8,NEWALLSPECIES,8,FALSE))","v":""},{"$f":"IF(A8=\"\",\"\",VLOOKUP(A8,NEWALLSPECIES,13,FALSE))","v":""},{"$f":"IF(ISERROR(K8/W8),\"\",K8/W8)","v":""},{"$f":"IF(ISERROR(G8/R8),\"\",G8/R8)","v":""},{"$f":"IF(ISERROR(G8/$D$38),\"\",G8/$D$38)","v":""},{"$f":"IF(ISERROR(G8*C8),\"\",C8*G8)","v":""},{"$f":"IF(ISERROR(J8/43560),\"\",J8/43560)","v":""},{"$f":"IF(ISERROR(K8/SUM($D$40)),\"\",K8/SUM($D$40))","v":""},{"$f":"IF(ISERROR(G8*F8),\"\",G8*F8)","v":""},null,null,null,{"$f":"IF(N8=\"\",\"50\",((O8+P8)*N8)/100)","v":"50"},{"$f":"IF(Q8=\"\",\"\",(Q8/100))","v":0.5},{"$f":"IF(ISERROR(G8/R8),\"\",G8/R8)","v":""},{"$f":"IF(ISERROR(H8*F8),\"\",F8*H8)","v":""},{"$f":"IF(ISERROR(H8*C8),\"\",H8*C8)","v":""},{"$f":"IF(ISERROR(U8/43560),\"\",U8/43560)","v":""},{"$f":"IF(A8=\"\",\"\",VLOOKUP(A8,NEWALLSPECIES,23,FALSE))","v":""},null,"purple giant hyssop","Agastache scrophulariifolia","P","very high ","mid","purple","2-6","med, wet","full ","6.5-7.0","n/a",1000000,80,"WD,MWD","attractive to bees and butterflies,birds, RARE","FACW","ny,any,pa,mn,wv"]
[null,null,"","","","",{"$f":"IF(ISERROR(K9/W9),\"\",K9/W9)","v":""},{"$f":"IF(ISERROR(G9/R9),\"\",G9/R9)","v":""},{"$f":"IF(ISERROR(G9/$D$38),\"\",G9/$D$38)","v":""},{"$f":"IF(ISERROR(G9*C9),\"\",C9*G9)","v":""},{"$f":"IF(ISERROR(J9/43560),\"\",J9/43560)","v":""},{"$f":"IF(ISERROR(K9/SUM($D$40)),\"\",K9/SUM($D$40))","v":""},{"$f":"IF(ISERROR(G9*F9),\"\",G9*F9)","v":""},null,null,null,{"$f":"IF(N9=\"\",\"50\",((O9+P9)*N9)/100)","v":"50"},{"$f":"IF(Q9=\"\",\"\",(Q9/100))","v":0.5},{"$f":"IF(ISERROR(G9/R9),\"\",G9/R9)","v":""},{"$f":"IF(ISERROR(H9*F9),\"\",F9*H9)","v":""},{"$f":"IF(ISERROR(H9*C9),\"\",H9*C9)","v":""},{"$f":"IF(ISERROR(U9/43560),\"\",U9/43560)","v":""},"",null,"leadplant","Amorpha canescens","P","high","early,mid","purple","2-3","dry, medium","sun-part",null,"slow",256000,210,"WD,MWD, SPW,PD","legume ","UPL","any,mi,mn"]
[null,null,"","","","","","","","","","","",null,null,null,"50",0.5,"","","","","",null,"common bluestar","Amsonia tabernaemontana","P","high","early","blue","2-4","medium, wet","sun-part",null,null,363000,null,"WD","exotic looking flowers","FACW","any,"]
[null,null,"","","","","","","","","","","",null,null,null,"50",0.5,"","","","","",null,"purplestem angelica","Angelica atropurpurea","P","high","mid","white","1-2","medium,wet","sun",null,null,86400,200,null,"host for American painted lady caterpillar","OBL","any,"]
[null,null,"","","","","","","","","","","",null,null,null,"50",0.5,"","","","","",null,"indian hemp","Apocynum  cannabinum","P","medium,low "," mid","white","2-6","dry, med","full","4.5-7","high",500000,280,"WD,MWD,SPD","extensive root system, fairly aggressive","FAC","ny,any"]
[null,null,"","","","","","","","","","","",null,null,null,"50",0.5,"","","","","",null,"red columbine","Aquilegia canadensis","P","high","early","red","1-2","dry, medium","sun-part shade",null,"slow",400000,480,"WD","deer resistant, native bees, humming birds","FACU","VA,ANY,ny"]
[null,null,"","","","","","","","","","","",null,null,null,"50",0.5,"","","","","",null,"common milkweed","Asclepias  syriaca","P","high ","early, mid","pink purple","3-4","dry, med","full to partial","5.6-7.5","high",68000,180,"WD,MWD","attracts monarchs; cuttings will bloom in first year, seeds may not","UPL","ny,any,pa,md,mi,mn"]
[null,null,"","","","","","","","","","","",null,null,null,"50",0.5,"","","","","",null,"swamp milkweed","Asclepias incarnata","P","high ","mid","pink","2-3","wet","full to partial","5-8","slow",75000,280,"SPD,PD","good for wetlands; great for monarch; high deer resistant","OBL","VA,ANY,ny,pa,mi,mn"]
{"$rows_left_out":100}
{"sheet":"SEEDINGPLANSHEET","index":3,"n_rows":62,"n_cols":14,"rows_kept":62,"cut":false,"hidden":false,"merged":[]}
[null,null,"Name:",null,null,null,"Date:",{"$f":"TODAY()","v":"2020-01-02"}]
[null,null,"Prepared By:",null,null,null,"Tract No:"]
[null,null,null,null,null,null,"Field No:"]
[null,null,null,null,null,null,"Contract No:",null,null,null,null,null,null,"DELETES UNUSED ROWS"]
[null,null,null,null,null,null,"Area of Field (in Acres):",1]
[]
[]
[]
[null,"Scientific Name","Common Name","PLS for lot of seed","lbs/A (PLS) Seeding Rate","Seeds/ sq Foot (PLS)","Seeds/ sq foot (Bulk)","lbs/A (Bulk) Seed ordered","Estimated Cost (lb/A) **"]
[null,"FORBS/LEGUMES",null,null,null,null,null,null,null,null,"**NEED TO RESET THIS SHEET TO PUT THE LINES BACK"]
[1,{"$f":"IF(ISNA(VLOOKUP(calculator!A8,NEWALLSPECIES,2,FALSE)),\"\",VLOOKUP(calculator!A8,NEWALLSPECIES,2,FALSE))","v":""},{"$f":"IF(ISBLANK(calculator!A8),\"\",calculator!A8)","v":""},{"$f":"IF(C11=\"\",\"\",calculator!R8)","v":""},{"$f":"IF(C11=\"\",\"\",calculator!G8)","v":""},{"$f":"IF(C11=\"\",\"\",calculator!K8)","v":""},{"$f":"IF(C11=\"\",\"\",calculator!V8)","v":""},{"$f":"IF(C11=\"\",\"\",$H$5*calculator!H8)","v":""},{"$f":"IF(C11=\"\",\"\",H11*calculator!F8)","v":""},null,"**WHEN CALCULATOR IS RESET, THIS SHEET WILL CLEAR"]
[2,{"$f":"IF(ISNA(VLOOKUP(calculator!A9,NEWALLSPECIES,2,FALSE)),\"\",VLOOKUP(calculator!A9,NEWALLSPECIES,2,FALSE))","v":""},{"$f":"IF(ISBLANK(calculator!A9),\"\",calculator!A9)","v":""},{"$f":"IF(C12=\"\",\"\",calculator!R9)","v":""},{"$f":"IF(C12=\"\",\"\",calculator!G9)","v":""},{"$f":"IF(C12=\"\",\"\",calculator!K9)","v":""},{"$f":"IF(C12=\"\",\"\",calculator!V9)","v":""},{"$f":"IF(C12=\"\",\"\",$H$5*calculator!H9)","v":""},{"$f":"IF(C12=\"\",\"\",H12*calculator!F9)","v":""}]
[3,{"$f":"IF(ISNA(VLOOKUP(calculator!A10,NEWALLSPECIES,2,FALSE)),\"\",VLOOKUP(calculator!A10,NEWALLSPECIES,2,FALSE))","v":""},{"$f":"IF(ISBLANK(calculator!A10),\"\",calculator!A10)","v":""},{"$f":"IF(C13=\"\",\"\",calculator!R10)","v":""},{"$f":"IF(C13=\"\",\"\",calculator!G10)","v":""},{"$f":"IF(C13=\"\",\"\",calculator!K10)","v":""},{"$f":"IF(C13=\"\",\"\",calculator!V10)","v":""},{"$f":"IF(C13=\"\",\"\",$H$5*calculator!H10)","v":""},{"$f":"IF(C13=\"\",\"\",H13*calculator!F10)","v":""}]
[4,{"$f":"IF(ISNA(VLOOKUP(calculator!A11,NEWALLSPECIES,2,FALSE)),\"\",VLOOKUP(calculator!A11,NEWALLSPECIES,2,FALSE))","v":""},{"$f":"IF(ISBLANK(calculator!A11),\"\",calculator!A11)","v":""},{"$f":"IF(C14=\"\",\"\",calculator!R11)","v":""},{"$f":"IF(C14=\"\",\"\",calculator!G11)","v":""},{"$f":"IF(C14=\"\",\"\",calculator!K11)","v":""},{"$f":"IF(C14=\"\",\"\",calculator!V11)","v":""},{"$f":"IF(C14=\"\",\"\",$H$5*calculator!H11)","v":""},{"$f":"IF(C14=\"\",\"\",H14*calculator!F11)","v":""}]
[5,{"$f":"IF(ISNA(VLOOKUP(calculator!A12,NEWALLSPECIES,2,FALSE)),\"\",VLOOKUP(calculator!A12,NEWALLSPECIES,2,FALSE))","v":""},{"$f":"IF(ISBLANK(calculator!A12),\"\",calculator!A12)","v":""},{"$f":"IF(C15=\"\",\"\",calculator!R12)","v":""},{"$f":"IF(C15=\"\",\"\",calculator!G12)","v":""},{"$f":"IF(C15=\"\",\"\",calculator!K12)","v":""},{"$f":"IF(C15=\"\",\"\",calculator!V12)","v":""},{"$f":"IF(C15=\"\",\"\",$H$5*calculator!H12)","v":""},{"$f":"IF(C15=\"\",\"\",H15*calculator!F12)","v":""}]
{"$rows_left_out":48}
{"sheet":"Forbs_legumes","index":4,"n_rows":661,"n_cols":23,"rows_kept":661,"cut":false,"hidden":false,"merged":[]}
["Common name","scientific name","plant Type","pollinator ranking","Flower Time","bloom color","plant ht (ft)","soil moisture","sunlight needs","ph","Vegetative spread","seeds/ lb*","Cost (lb) ($)","drainage","other","wetland indicator","State","% of Mix",null,null,null,null,"# of seeds/sq ft @ 1 lb of seed/A"]
[null,null,null,null,null,null,null,null,null,null,null,null,null,null,null,null,null,null,null,null,null,"*any"]
["yarrow","Achillea millefolium",null,null,null,null,null,null,null,null,null,null,30,null,null,null,"any"]
["black bugbane","Actaea racemosa","P","high","early, mid","white","3-6","medium, wet","sun-part",null,"slow",500000,300,null,"blooms earlier than the others","FACW","any,",null,null,null,null,"*CT",{"$f":"L4/43560","v":11.478420569329661}]
["purple false foxglove","Agalinis purpurea","A","high","early, mid, late","purple","1-2","medium, wet","sun-part",null,null,12480000,500,"WD,MWDMSPD, PD","high bee preference","FACW","any,",null,null,null,null,"*MA",286.50137741046831]
["lavender hysoop","Agastache foeniculum","P","high","mid, late","blue-violet","3-5","dry, medium","sun-part",null,"slow",1440000,172,"WD ","honey bee, bumble bee (N)","FACU","any,mn,wv",null,"*early","*dry","*low","*ME",33.057851239669418]
["yellow giant hyssop","Agastache nepetoides","P","high","late","yellow","3-8","dry, medium","sun-part",null,null,1480000,200,null,null,"FACU","any,mn,wv",null,"*mid","*med","*med","*MI",33.976124885215796]
["purple giant hyssop","Agastache scrophulariifolia","P","very high ","mid","purple","2-6","med, wet","full ","6.5-7.0","n/a",1000000,80,"WD,MWD","attractive to bees and butterflies,birds, RARE","FACW","ny,any,pa,mn,wv",null,"*late","*wet","*high","*NH",22.956841138659321]
["leadplant","Amorpha canescens","P","high","early,mid","purple","2-3","dry, medium","sun-part",null,"slow",256000,210,"WD,MWD, SPW,PD","legume ","UPL","any,mi,mn",null,null,null,null,"*NJ",5.8769513314967856]
["common bluestar","Amsonia tabernaemontana","P","high","early","blue","2-4","medium, wet","sun-part",null,null,363000,null,"WD","exotic looking flowers","FACW","any,",null,null,null,null,"*NY",8.3333333333333339]
["purplestem angelica","Angelica atropurpurea","P","high","mid","white","1-2","medium,wet","sun",null,null,86400,200,null,"host for American painted lady caterpillar","OBL","any,","1-2% of a mix",null,null,null,"*PA",1.9834710743801653]
["indian hemp","Apocynum  cannabinum","P","medium,low "," mid","white","2-6","dry, med","full","4.5-7","high",500000,280,"WD,MWD,SPD","extensive root system, fairly aggressive","FAC","ny,any","1-2% of a mix",null,null,null,"*RI",11.478420569329661]
["red columbine","Aquilegia canadensis","P","high","early","red","1-2","dry, medium","sun-part shade",null,"slow",400000,480,"WD","deer resistant, native bees, humming birds","FACU","VA,ANY,ny","1-5% of a mix",null,null,null,"*VT",9.1827364554637274]
["common milkweed","Asclepias  syriaca","P","high ","early, mid","pink purple","3-4","dry, med","full to partial","5.6-7.5","high",68000,180,"WD,MWD","attracts monarchs; cuttings will bloom in first year, seeds may not","UPL","ny,any,pa,md,mi,mn","1-10%",null,null,null,null,1.5610651974288339]
["swamp milkweed","Asclepias incarnata","P","high ","mid","pink","2-3","wet","full to partial","5-8","slow",75000,280,"SPD,PD","good for wetlands; great for monarch; high deer resistant","OBL","VA,ANY,ny,pa,mi,mn","1-10%",null,null,null,null,1.721763085399449]
{"$rows_left_out":647}
{"sheet":"grass","index":5,"n_rows":23,"n_cols":16,"rows_kept":23,"cut":false,"hidden":false,"merged":[]}
["Common Name","Scientific Name","Cultivar Name","plant type","Cost/lb (PLS)","ORIGIN ","Rooting Habit","hts (ft)","ph","seeds/ lb*","soil moisture","FLOOD TOL."," SHADE TOL. ","SALT TOL.","DROUGHT TOLERANCE ","# of seeds/sq ft @ 1 lb of seed/A"]
[]
["big bluestem","Andropogon gerardii","Niagara","warm season grass",12,"native","bunch","4-6","6-7.5",150000,"W-WM","yes","No","Mod","mod",{"$f":"J3/43560","v":3.443526170798898}]
["broomsedge","Andropogon virginicus",null,"warm season grass",84,"Native","bunch","3","4.7-9",800000,"W-MW","no","No","low","High",18.365472910927455]
["sideoats grama","Bouteloua curtipendula",null,"warm season grass",20,"Native","bunch",3,"6-9",150000,null,"no","No","high","high",3.443526170798898]
["blue grama","Bouteloua gracilis",null,"warm season grass",30,"Native","bunch","1","6.6-8.4",720000,null,"No","No","Mod","High",16.528925619834709]
["bluejoint","Calamagrostis canadensis",null,"cool season grass",232,"native"]
["Emory's sedge","Carex emoryi",null,"sedge",640,"Native","bunch","2",null,848000,null,"yes","No","low","Low",19.467401285583104]
["shallow sedge","Carex lurida",null,"sedge",54,"Native","bunch","1","3",250000,null,"Yes","intermediate","low","Low",5.7392102846648303]
["PA sedge","Carex pensyvanica",null,"sedge",30,"native","bunch","1.5",null,864000,null,"mod","intermediate",null,"Low",19.834710743801654]
["fox sedge","Carex vulpinoidea",null,"sedge",16,"Native","bunch","3","6.8-8.9",19000,null,"Yes","intermediate","none","Low",0.43617998163452709]
["Deertongue","Dichanthelium clandestinum","Tioga'","warm season grass",16,"Native","bunch","2","3.8-5.0",350000,"EXDR-SWPD","Yes","No","Low","High",8.0348943985307617]
["Canada Wildrye","Elymus canadensis",null,"cool season grass",15,"Native","bunch","3-4","5.0-8.0",114000,"WD-MWD","Low","Yes","Mod","Mod",2.6170798898071626]
["riparian wildrye","Elymus riparius","Pa Ecotype","cool season grass",15,"Native","bunch","4","4.5-7.2",125000,null,"mod","Yes","none","Low",2.8696051423324151]
["Virginia Wildrye","Elymus virginicus","Pa Ecotype","cool season grass",15,"Native","bunch","3-4","5.0-7.0",100000,"MWD-PD","Yes","Yes","Mod","Low",2.2956841138659319]
{"$rows_left_out":9}
{"sheet":"Sheet1","index":6,"n_rows":64,"n_cols":20,"rows_kept":64,"cut":false,"hidden":true,"merged":[]}
["Scientific name","Common name","A/P","Native range","poll plant","bloom time","flower color","ht","Soil moisture","sunlight needs","wetland indicator","growth rate","seeds/lb","Cost (lb) ($)","drainage","other","SOURCES","other"]
["Achillea millefolium","common yarrow",null,"58,63,59,67,69,70,82,83","B","mid","white","2-3",null,"sun-part",null,null,3000000,null,null,null,"SS,JF","small native bees"]
["Acornus americanus","sweetflag",null,null,"B","early, mid","yellow","3-4","moist, wet","sun","OBL","rapid",null,null,null,null,"RB,EC,NC,ANP,EVT","deer resistant","swamps, bogs"]
["Acorus calamus","calamus",null,58,"B","early","green","1-4","wet","sun-part","OBL","mod",105600,null,null,null,"PMN,AG,SS,WSC,JF","naturalized"]
["Agalinis purpurea","purple false foxglove","A","NY,NH,MA,RI,CT,NJ,PA","B","early, mid, late","purple","1-2","moist, wet",null,"FACW-",null,12480000,null,null,null,"JF","high bee preference"]
["Agastache foeniculum","lavender hysoop","P","NY,PA,NH,CT","B","mid, late","blue-violet","3-5","dry, medium","sun-part","FACU",null,1440000,null,null,null,"SS,JF,MW,RB,NC","honey bee, bumble bee (N)","prolific seed producer"]
["Agastache nepetoides","yellow giant hyssop","P",70,"B","mid, late","yellow","3-8","dry, medium","sun-part","UPL",null,1480000,null,null,null,"PMN,AG, MW"]
["Amorpha canescens","leadplant","P","MI","B","early, mid","purple","2-3","dry, medium","sun-part","UPL",null,256000,null,null,null,"SS,JF","legume ","silver spotted skipper"]
["Amorpha fruticosa","desert false indigo","P","58,63,67,70,82","B","early-mid","purple","1-2",null,"sun ","FACW",null,"272000; 59200",null,null,null,"E,PMN,JF,RB","legume",null,"1-10% in a riparian mix"]
["Amsonia tabernaemontana","common bluestar","P",null,"B","early","blue","2-4","moist, wet","sun-part",null,null,null,null,null,null,"AGN,ET,MW,RB,EF","exotic looking flowers"]
["Angelica atropurpurea","purplestem angelica",null,58,"B","mid","white","1-2","dry, medium","sun","UPL",null,86400,null,null,null,"PMN,AG,ET,SS,JF","host for American painted lady caterpillar"]
["Aquilegia canadensis","red columbine","P","58,59,67,69,70,82,83","B","early","red","1-2","medium, wet","sun-part","FAC",null,400000,null,null,null,"ED,ANP,BH,ET,CNN,SS,WSC,JF,MW,EC,FC,NC","deer resistant, native bees, humming birds","Columbine Duskywing larvae food","could be difficult to grow from seed"]
["Asclepias purpurascens","purple milkweed",null,58,"B","mid","purple","2 -3 ft",null,"sun-part","FACU",null,72000,null,null,null,"PMN,MW,RB,EF,FC","Attracts butterflies, hummingbirds","good substitute for sommon milkweed"]
["Asclepias verticillata","whorled milkweed",null,70,"B","mid","white","1-2",null,"sun-part","UPL",null,176000,null,null,null,"PMN,AG,ED,SS,JF,MW,NC"]
["Baptisia alba","white wild indigo",null,"63,67","B","early","white/yellow","2-3",null,"sun-part",null,null,null,null,null,null,"SS","larval food for wild indigo duskywing","easy and can adapt well"]
{"$rows_left_out":49}